Reaction Details
TargetPhosphatidylinositol 4,5-bisphosphate 3-kinase catalytic subunit beta isoform
LigandBDBM50396615
Substrate/Competitorn/a
Meas. Tech.ChEMBL_864103 (CHEMBL2174951)
Ki>125000±n/a nM
Citation Gonzalez-Lopez de Turiso, FShin, YBrown, MCardozo, MChen, YFong, DHao, XHe, XHenne, KHu, YLJohnson, MGKohn, TLohman, JMcBride, HJMcGee, LRMedina, JCMetz, DMiner, KMohn, DPattaropong, VSeganish, JSimard, JLWannberg, SWhittington, DAYu, GCushing, TD Discovery and in vivo evaluation of dual PI3Kß/d inhibitors. J Med Chem55:7667-85 (2012) 
 
Phosphatidylinositol 4,5-bisphosphate 3-kinase catalytic subunit beta isoform
Name:Phosphatidylinositol 4,5-bisphosphate 3-kinase catalytic subunit beta isoform
Type:Enzyme Subunit
Mol. Mass.:122769.00
Organism:Homo sapiens (Human)
Description:P42338
Residue:1070
BDBM50396615
NameBDBM50396615
Synonyms:CHEMBL2171928 | US8765940, 4-(1-(7-fluoro-3-methyl-2-(2-pyridinyl)-4-quinolinyl)-3,3-dimethyl-2,3-dihydro-1H-indol-6-yl)-6-methyl-2-pyrimidinamine
TypeSmall organic molecule
Emp. Form.C30H27FN6
Mol. Mass.490.574
SMILESCc1cc(nc(N)n1)-c1ccc2c(c1)N(CC2(C)C)c1c(C)c(nc2cc(F)ccc12)-c1ccccn1