Reaction Details
TargetAldo-keto reductase family 1 member C1
LigandBDBM50396691
Substrate/Competitorn/a
Meas. Tech.ChEMBL_864154 (CHEMBL2175103)
Ki 106000±n/a nM
Citation Jamieson, SMBrooke, DGHeinrich, DAtwell, GJSilva, SHamilton, EJTurnbull, APRigoreau, LJTrivier, ESoudy, CSamlal, SSOwen, PJSchroeder, ERaynham, TFlanagan, JUDenny, WA 3-(3,4-Dihydroisoquinolin-2(1H)-ylsulfonyl)benzoic Acids: highly potent and selective inhibitors of the type 5 17-ß-hydroxysteroid dehydrogenase AKR1C3. J Med Chem55:7746-58 (2012) 
 
Aldo-keto reductase family 1 member C1
Name:Aldo-keto reductase family 1 member C1
Type:Enzyme
Mol. Mass.:36793.97
Organism:Homo sapiens (Human)
Description:Recombinant AKR1C1 enzyme was expressed in E. coli.
Residue:323
BDBM50396691
NameBDBM50396691
Synonyms:CHEMBL449572 | US9271961, Jasmonic acid
TypeSmall organic molecule
Emp. Form.C12H18O3
Mol. Mass.210.2695
SMILESCC\C=C/C[C@@H]1[C@@H](CC(O)=O)CCC1=O