Reaction Details
TargetAldo-keto reductase family 1 member C4
LigandBDBM50396696
Substrate/Competitorn/a
Meas. Tech.ChEMBL_864143 (CHEMBL2174991)
IC50>30000±n/a nM
Citation Jamieson, SMBrooke, DGHeinrich, DAtwell, GJSilva, SHamilton, EJTurnbull, APRigoreau, LJTrivier, ESoudy, CSamlal, SSOwen, PJSchroeder, ERaynham, TFlanagan, JUDenny, WA 3-(3,4-Dihydroisoquinolin-2(1H)-ylsulfonyl)benzoic Acids: highly potent and selective inhibitors of the type 5 17-ß-hydroxysteroid dehydrogenase AKR1C3. J Med Chem55:7746-58 (2012) 
 
Aldo-keto reductase family 1 member C4
Name:Aldo-keto reductase family 1 member C4
Type:Enzyme
Mol. Mass.:37068.40
Organism:Homo sapiens (Human)
Description:P17516
Residue:323
BDBM50396696
NameBDBM50396696
Synonyms:CHEMBL2172064
TypeSmall organic molecule
Emp. Form.C24H23NO4S
Mol. Mass.421.509
SMILESOC(=O)C1CCCN(C1)S(=O)(=O)c1ccc(cc1)-c1cccc(c1)-c1ccccc1