Reaction Details
TargetAldo-keto reductase family 1 member C1
LigandBDBM50396697
Substrate/Competitorn/a
Meas. Tech.ChEMBL_864146 (CHEMBL2175095)
IC50 11000±n/a nM
Citation Jamieson, SMBrooke, DGHeinrich, DAtwell, GJSilva, SHamilton, EJTurnbull, APRigoreau, LJTrivier, ESoudy, CSamlal, SSOwen, PJSchroeder, ERaynham, TFlanagan, JUDenny, WA 3-(3,4-Dihydroisoquinolin-2(1H)-ylsulfonyl)benzoic Acids: highly potent and selective inhibitors of the type 5 17-ß-hydroxysteroid dehydrogenase AKR1C3. J Med Chem55:7746-58 (2012) 
 
Aldo-keto reductase family 1 member C1
Name:Aldo-keto reductase family 1 member C1
Type:Enzyme
Mol. Mass.:36793.97
Organism:Homo sapiens (Human)
Description:Recombinant AKR1C1 enzyme was expressed in E. coli.
Residue:323
BDBM50396697
NameBDBM50396697
Synonyms:CHEMBL2172060
TypeSmall organic molecule
Emp. Form.C18H18ClNO4S
Mol. Mass.379.858
SMILESOC(=O)C1CCCN(C1)S(=O)(=O)c1ccc(cc1)-c1ccccc1Cl