Reaction Details
TargetAldo-keto reductase family 1 member C3
LigandBDBM50396719
Substrate/Competitorn/a
Meas. Tech.ChEMBL_864144 (CHEMBL2174992)
IC50 14±n/a nM
Citation Jamieson, SMBrooke, DGHeinrich, DAtwell, GJSilva, SHamilton, EJTurnbull, APRigoreau, LJTrivier, ESoudy, CSamlal, SSOwen, PJSchroeder, ERaynham, TFlanagan, JUDenny, WA 3-(3,4-Dihydroisoquinolin-2(1H)-ylsulfonyl)benzoic Acids: highly potent and selective inhibitors of the type 5 17-ß-hydroxysteroid dehydrogenase AKR1C3. J Med Chem55:7746-58 (2012) 
 
Aldo-keto reductase family 1 member C3
Name:Aldo-keto reductase family 1 member C3
Type:Enzyme
Mol. Mass.:36859.86
Organism:Homo sapiens (Human)
Description:P42330
Residue:323
BDBM50396719
NameBDBM50396719
Synonyms:CHEMBL2172088
TypeSmall organic molecule
Emp. Form.C16H14INO4S
Mol. Mass.443.256
SMILESOC(=O)c1cccc(c1)S(=O)(=O)N1CCc2ccc(I)cc2C1