Reaction Details
TargetAldo-keto reductase family 1 member C2
LigandBDBM50396734
Substrate/Competitorn/a
Meas. Tech.ChEMBL_864306 (CHEMBL2175577)
Ki 119000±n/a nM
Citation Brožic, PTurk, SAdeniji, AOKonc, JJanežic, DPenning, TMLanišnik Rižner, TGobec, S Selective inhibitors of aldo-keto reductases AKR1C1 and AKR1C3 discovered by virtual screening of a fragment library. J Med Chem55:7417-24 (2012) 
 
Aldo-keto reductase family 1 member C2
Name:Aldo-keto reductase family 1 member C2
Type:Enzyme
Mol. Mass.:36739.89
Organism:Homo sapiens (Human)
Description:n/a
Residue:323
BDBM50396734
NameBDBM50396734
Synonyms:CHEMBL1896308
TypeSmall organic molecule
Emp. Form.C14H13NO4S
Mol. Mass.291.322
SMILESCN(c1ccc(cc1)C(O)=O)S(=O)(=O)c1ccccc1