Reaction Details
TargetAldo-keto reductase family 1 member C2
LigandBDBM50396742
Substrate/Competitorn/a
Meas. Tech.ChEMBL_864306 (CHEMBL2175577)
Ki 90000±n/a nM
Citation Brožic, PTurk, SAdeniji, AOKonc, JJanežic, DPenning, TMLanišnik Rižner, TGobec, S Selective inhibitors of aldo-keto reductases AKR1C1 and AKR1C3 discovered by virtual screening of a fragment library. J Med Chem55:7417-24 (2012) 
 
Aldo-keto reductase family 1 member C2
Name:Aldo-keto reductase family 1 member C2
Type:Enzyme
Mol. Mass.:36739.89
Organism:Homo sapiens (Human)
Description:n/a
Residue:323
BDBM50396742
NameBDBM50396742
Synonyms:CHEMBL1373742
TypeSmall organic molecule
Emp. Form.C14H13NO5
Mol. Mass.275.2567
SMILESCc1cc(C(=O)Nc2ccc(O)c(c2)C(O)=O)c(C)o1