Reaction Details
TargetAldo-keto reductase family 1 member C1
LigandBDBM34643
Substrate/Competitorn/a
Meas. Tech.ChEMBL_864307 (CHEMBL2175578)
Ki 19000±n/a nM
Citation Brožic, PTurk, SAdeniji, AOKonc, JJanežic, DPenning, TMLanišnik Rižner, TGobec, S Selective inhibitors of aldo-keto reductases AKR1C1 and AKR1C3 discovered by virtual screening of a fragment library. J Med Chem55:7417-24 (2012) 
 
Aldo-keto reductase family 1 member C1
Name:Aldo-keto reductase family 1 member C1
Type:Enzyme
Mol. Mass.:36793.97
Organism:Homo sapiens (Human)
Description:Recombinant AKR1C1 enzyme was expressed in E. coli.
Residue:323
BDBM34643
NameBDBM34643
Synonyms:3-(2-carboxyethylamino)-2-naphthalenecarboxylic acid 3-(2-carboxyethylamino)naphthalene-2-carboxylic acid MLS000104959 cid_767169
TypeSmall organic molecule
Emp. Form.C14H13NO4
Mol. Mass.259.2573
SMILESOC(=O)CCNc1cc2ccccc2cc1C(O)=O