Reaction Details
TargetAldo-keto reductase family 1 member C1
LigandBDBM50396747
Substrate/Competitorn/a
Meas. Tech.ChEMBL_864307 (CHEMBL2175578)
Ki 122000±n/a nM
Citation Brožic, PTurk, SAdeniji, AOKonc, JJanežic, DPenning, TMLanišnik Rižner, TGobec, S Selective inhibitors of aldo-keto reductases AKR1C1 and AKR1C3 discovered by virtual screening of a fragment library. J Med Chem55:7417-24 (2012) 
 
Aldo-keto reductase family 1 member C1
Name:Aldo-keto reductase family 1 member C1
Type:Enzyme
Mol. Mass.:36793.97
Organism:Homo sapiens (Human)
Description:Recombinant AKR1C1 enzyme was expressed in E. coli.
Residue:323
BDBM50396747
NameBDBM50396747
Synonyms:CHEMBL2172241
TypeSmall organic molecule
Emp. Form.C14H14N2O4
Mol. Mass.274.272
SMILESCc1oc(cc1COc1ccccc1C(N)=O)C(N)=O