Reaction Details
TargetAldo-keto reductase family 1 member C3
LigandBDBM50396749
Substrate/Competitorn/a
Meas. Tech.ChEMBL_864305 (CHEMBL2175576)
Ki 2000±n/a nM
Citation Brožic, PTurk, SAdeniji, AOKonc, JJanežic, DPenning, TMLanišnik Rižner, TGobec, S Selective inhibitors of aldo-keto reductases AKR1C1 and AKR1C3 discovered by virtual screening of a fragment library. J Med Chem55:7417-24 (2012) 
 
Aldo-keto reductase family 1 member C3
Name:Aldo-keto reductase family 1 member C3
Type:Enzyme
Mol. Mass.:36859.86
Organism:Homo sapiens (Human)
Description:P42330
Residue:323
BDBM50396749
NameBDBM50396749
Synonyms:CHEMBL2172258
TypeSmall organic molecule
Emp. Form.C11H10N2O4S
Mol. Mass.266.273
SMILESOc1[nH]c(=O)sc1CC(=O)Nc1ccccc1O