Reaction Details
Target7-dehydrocholesterol reductase
LigandBDBM50170646
Substrate/Competitorn/a
Meas. Tech.ChEMBL_864350 (CHEMBL2175827)
IC50 500±n/a nM
Citation Horling, AMüller, CBarthel, RBracher, FImming, P A new class of selective and potent 7-dehydrocholesterol reductase inhibitors. J Med Chem55:7614-22 (2012) 
 
7-dehydrocholesterol reductase
Name:7-dehydrocholesterol reductase
Type:PROTEIN
Mol. Mass.:54508.42
Organism:Homo sapiens (Human)
Description:ChEMBL_864350
Residue:475
BDBM50170646
NameBDBM50170646
Synonyms:4-(2-{4-[(E)-3-(4-Chloro-phenyl)-allyl]-piperazin-1-yl}-ethyl)-benzoic acid CHEMBL2172263
TypeSmall organic molecule
Emp. Form.C22H25ClN2O2
Mol. Mass.384.899
SMILESOC(=O)c1ccc(CCN2CCN(C\C=C\c3ccc(Cl)cc3)CC2)cc1