Reaction Details
TargetcAMP-specific 3',5'-cyclic phosphodiesterase 4A
LigandBDBM50108504
Substrate/Competitorn/a
Meas. Tech.ChEMBL_864514 (CHEMBL2176423)
IC50 602±n/a nM
Citation Press, NJTaylor, RJFullerton, JDTranter, PMcCarthy, CKeller, THArnold, NBeer, DBrown, LCheung, RChristie, JDenholm, AHaberthuer, SHatto, JDKeenan, MMercer, MKOakman, HSahri, HTuffnell, ARTweed, MTyler, JWWagner, TFozard, JRTrifilieff, A Solubility-driven optimization of phosphodiesterase-4 inhibitors leading to a clinical candidate. J Med Chem55:7472-9 (2012) 
 
cAMP-specific 3',5'-cyclic phosphodiesterase 4A
Name:cAMP-specific 3',5'-cyclic phosphodiesterase 4A
Type:Enzyme
Mol. Mass.:98113.27
Organism:Homo sapiens (Human)
Description:P27815
Residue:886
BDBM50108504
NameBDBM50108504
Synonyms:4-(8-(benzo[c][1,2,5]oxadiazol-5-yl)-1,7-naphthyridin-6-yl)benzoic acid CHEMBL77826
TypeSmall organic molecule
Emp. Form.C21H12N4O3
Mol. Mass.368.345
SMILESOC(=O)c1ccc(cc1)-c1cc2cccnc2c(n1)-c1ccc2nonc2c1