Reaction Details
TargetSodium/glucose cotransporter 1
LigandBDBM50396768
Substrate/Competitorn/a
Meas. Tech.ChEMBL_864703 (CHEMBL2174861)
IC50 126±n/a nM
Citation Ohtake, YSato, TKobayashi, TNishimoto, MTaka, NTakano, KYamamoto, KOhmori, MYamaguchi, MTakami, KYeu, SYAhn, KHMatsuoka, HMorikawa, KSuzuki, MHagita, HOzawa, KYamaguchi, KKato, MIkeda, S Discovery of tofogliflozin, a novel C-arylglucoside with an O-spiroketal ring system, as a highly selective sodium glucose cotransporter 2 (SGLT2) inhibitor for the treatment of type 2 diabetes. J Med Chem55:7828-40 (2012) 
 
Sodium/glucose cotransporter 1
Name:Sodium/glucose cotransporter 1
Type:Protein
Mol. Mass.:73503.78
Organism:Homo sapiens (Human)
Description:P13866
Residue:664
BDBM50396768
NameBDBM50396768
Synonyms:CHEMBL2172386
TypeSmall organic molecule
Emp. Form.C23H28O6
Mol. Mass.400.4648
SMILESCCc1ccc(Cc2cc3c(CO[C@]33O[C@H](CO)[C@@H](O)[C@H](O)[C@H]3O)cc2C)cc1