Reaction Details
TargetSodium/glucose cotransporter 2
LigandBDBM50396772
Substrate/Competitorn/a
Meas. Tech.ChEMBL_864704 (CHEMBL2174862)
IC50 117.9±n/a nM
Citation Ohtake, YSato, TKobayashi, TNishimoto, MTaka, NTakano, KYamamoto, KOhmori, MYamaguchi, MTakami, KYeu, SYAhn, KHMatsuoka, HMorikawa, KSuzuki, MHagita, HOzawa, KYamaguchi, KKato, MIkeda, S Discovery of tofogliflozin, a novel C-arylglucoside with an O-spiroketal ring system, as a highly selective sodium glucose cotransporter 2 (SGLT2) inhibitor for the treatment of type 2 diabetes. J Med Chem55:7828-40 (2012) 
 
Sodium/glucose cotransporter 2
Name:Sodium/glucose cotransporter 2
Type:Protein
Mol. Mass.:72902.00
Organism:Homo sapiens (Human)
Description:P31639
Residue:672
BDBM50396772
NameBDBM50396772
Synonyms:CHEMBL2172382
TypeSmall organic molecule
Emp. Form.C21H21NO6
Mol. Mass.383.3945
SMILESOC[C@H]1O[C@]2(OCc3ccc(Cc4ccc(cc4)C#N)cc23)[C@H](O)[C@@H](O)[C@@H]1O