Reaction Details
TargetThermolysin
LigandBDBM50396786
Substrate/Competitorn/a
Meas. Tech.ChEMBL_864915 (CHEMBL2175865)
Ki 289±n/a nM
Citation Nasief, NNTan, HKong, JHangauer, D Water mediated ligand functional group cooperativity: the contribution of a methyl group to binding affinity is enhanced by a COO(-) group through changes in the structure and thermodynamics of the hydration waters of ligand-thermolysin complexes. J Med Chem55:8283-302 (2012) 
 
Thermolysin
Name:Thermolysin
Type:PROTEIN
Mol. Mass.:60097.54
Organism:Bacillus thermoproteolyticus
Description:ChEMBL_1468794
Residue:548
BDBM50396786
NameBDBM50396786
Synonyms:CHEMBL2172740
TypeSmall organic molecule
Emp. Form.C17H27N3O5P
Mol. Mass.384.3877
SMILESCCNC(=O)[C@H](CC(C)C)NP([O-])(=O)CNC(=O)OCc1ccccc1