Reaction Details
TargetThermolysin
LigandBDBM50396788
Substrate/Competitorn/a
Meas. Tech.ChEMBL_864915 (CHEMBL2175865)
Ki 19.1±n/a nM
Citation Nasief, NNTan, HKong, JHangauer, D Water mediated ligand functional group cooperativity: the contribution of a methyl group to binding affinity is enhanced by a COO(-) group through changes in the structure and thermodynamics of the hydration waters of ligand-thermolysin complexes. J Med Chem55:8283-302 (2012) 
 
Thermolysin
Name:Thermolysin
Type:PROTEIN
Mol. Mass.:60097.54
Organism:Bacillus thermoproteolyticus
Description:ChEMBL_1468794
Residue:548
BDBM50396788
NameBDBM50396788
Synonyms:CHEMBL2172738
TypeSmall organic molecule
Emp. Form.C18H26N3O7P
Mol. Mass.427.3898
SMILESCC(C)C[C@H](NP([O-])(=O)CNC(=O)OCc1ccccc1)C(=O)N[C@@H](C)C([O-])=O