Reaction Details
TargetCarbonic anhydrase 12
LigandBDBM50396790
Substrate/Competitorn/a
Meas. Tech.ChEMBL_861926 (CHEMBL2173730)
IC50 8600±n/a nM
Citation Reich, RHoffman, AVeerendhar, AMaresca, AInnocenti, ASupuran, CTBreuer, E Carbamoylphosphonates control tumor cell proliferation and dissemination by simultaneously inhibiting carbonic anhydrase IX and matrix metalloproteinase-2. Toward nontoxic chemotherapy targeting tumor microenvironment. J Med Chem55:7875-82 (2012) 
 
Carbonic anhydrase 12
Name:Carbonic anhydrase 12
Type:Enzyme
Mol. Mass.:39456.00
Organism:Homo sapiens (Human)
Description:Catalytic domain of human cloned isozyme was used in the assay
Residue:354
BDBM50396790
NameBDBM50396790
Synonyms:CHEMBL2172745
TypeSmall organic molecule
Emp. Form.C16H17N2O6P
Mol. Mass.364.2897
SMILESOP(O)(=O)C(=O)NCCNC(=O)c1ccc(Oc2ccccc2)cc1