Reaction Details
TargetCarbonic anhydrase 12
LigandBDBM50396803
Substrate/Competitorn/a
Meas. Tech.ChEMBL_861926 (CHEMBL2173730)
IC50 6640±n/a nM
Citation Reich, RHoffman, AVeerendhar, AMaresca, AInnocenti, ASupuran, CTBreuer, E Carbamoylphosphonates control tumor cell proliferation and dissemination by simultaneously inhibiting carbonic anhydrase IX and matrix metalloproteinase-2. Toward nontoxic chemotherapy targeting tumor microenvironment. J Med Chem55:7875-82 (2012) 
 
Carbonic anhydrase 12
Name:Carbonic anhydrase 12
Type:Enzyme
Mol. Mass.:39456.00
Organism:Homo sapiens (Human)
Description:Catalytic domain of human cloned isozyme was used in the assay
Residue:354
BDBM50396803
NameBDBM50396803
Synonyms:CHEMBL2172746
TypeSmall organic molecule
Emp. Form.C9H18NO4P
Mol. Mass.235.2173
SMILESC[C@H](NC(=O)P(O)(O)=O)C1CCCCC1