Reaction Details
TargetCarbonic anhydrase 12
LigandBDBM50146801
Substrate/Competitorn/a
Meas. Tech.ChEMBL_861926 (CHEMBL2173730)
IC50 5590±n/a nM
Citation Reich, RHoffman, AVeerendhar, AMaresca, AInnocenti, ASupuran, CTBreuer, E Carbamoylphosphonates control tumor cell proliferation and dissemination by simultaneously inhibiting carbonic anhydrase IX and matrix metalloproteinase-2. Toward nontoxic chemotherapy targeting tumor microenvironment. J Med Chem55:7875-82 (2012) 
 
Carbonic anhydrase 12
Name:Carbonic anhydrase 12
Type:Enzyme
Mol. Mass.:39456.00
Organism:Homo sapiens (Human)
Description:Catalytic domain of human cloned isozyme was used in the assay
Residue:354
BDBM50146801
NameBDBM50146801
Synonyms:(cyclohexylamino)carbonylphosphonic acid | CHEMBL329784
TypeSmall organic molecule
Emp. Form.C7H14NO4P
Mol. Mass.207.1641
SMILESOP(O)(=O)C(=O)NC1CCCCC1