Reaction Details
TargetCarbonic anhydrase 9
LigandBDBM50396798
Substrate/Competitorn/a
Meas. Tech.ChEMBL_861925 (CHEMBL2173729)
IC50 8800±n/a nM
Citation Reich, RHoffman, AVeerendhar, AMaresca, AInnocenti, ASupuran, CTBreuer, E Carbamoylphosphonates control tumor cell proliferation and dissemination by simultaneously inhibiting carbonic anhydrase IX and matrix metalloproteinase-2. Toward nontoxic chemotherapy targeting tumor microenvironment. J Med Chem55:7875-82 (2012) 
 
Carbonic anhydrase 9
Name:Carbonic anhydrase 9
Type:Enzyme
Mol. Mass.:49669.03
Organism:Homo sapiens (Human)
Description:Catalytic domain of human cloned isozyme was used in the assay
Residue:459
BDBM50396798
NameBDBM50396798
Synonyms:CHEMBL1801472
TypeSmall organic molecule
Emp. Form.C7H15N2O4P
Mol. Mass.222.1788
SMILESOP(O)(=O)C(=O)NCCN1CCCC1