Reaction Details
TargetCarbonic anhydrase 2
LigandBDBM50396792
Substrate/Competitorn/a
Meas. Tech.ChEMBL_861927 (CHEMBL2173731)
IC50 310±n/a nM
Citation Reich, RHoffman, AVeerendhar, AMaresca, AInnocenti, ASupuran, CTBreuer, E Carbamoylphosphonates control tumor cell proliferation and dissemination by simultaneously inhibiting carbonic anhydrase IX and matrix metalloproteinase-2. Toward nontoxic chemotherapy targeting tumor microenvironment. J Med Chem55:7875-82 (2012) 
 
Carbonic anhydrase 2
Name:Carbonic anhydrase 2
Type:Enzyme
Mol. Mass.:29250.71
Organism:Homo sapiens (Human)
Description:P00918
Residue:260
BDBM50396792
NameBDBM50396792
Synonyms:CHEMBL2170080
TypeSmall organic molecule
Emp. Form.C18H23N2O7PS
Mol. Mass.442.423
SMILESOP(O)(=O)C(=O)NCCCCCNS(=O)(=O)c1ccc(Oc2ccccc2)cc1