Reaction Details
TargetCarbonic anhydrase 2
LigandBDBM50396797
Substrate/Competitorn/a
Meas. Tech.ChEMBL_861927 (CHEMBL2173731)
IC50 8280±n/a nM
Citation Reich, RHoffman, AVeerendhar, AMaresca, AInnocenti, ASupuran, CTBreuer, E Carbamoylphosphonates control tumor cell proliferation and dissemination by simultaneously inhibiting carbonic anhydrase IX and matrix metalloproteinase-2. Toward nontoxic chemotherapy targeting tumor microenvironment. J Med Chem55:7875-82 (2012) 
 
Carbonic anhydrase 2
Name:Carbonic anhydrase 2
Type:Enzyme
Mol. Mass.:29250.71
Organism:Homo sapiens (Human)
Description:P00918
Residue:260
BDBM50396797
NameBDBM50396797
Synonyms:CHEMBL2172750
TypeSmall organic molecule
Emp. Form.C7H15N2O4P
Mol. Mass.222.1788
SMILESN[C@H]1CCCC[C@@H]1NC(=O)P(O)(O)=O