Reaction Details
TargetCarbonic anhydrase 2
LigandBDBM50146798
Substrate/Competitorn/a
Meas. Tech.ChEMBL_861927 (CHEMBL2173731)
IC50 7890±n/a nM
Citation Reich, RHoffman, AVeerendhar, AMaresca, AInnocenti, ASupuran, CTBreuer, E Carbamoylphosphonates control tumor cell proliferation and dissemination by simultaneously inhibiting carbonic anhydrase IX and matrix metalloproteinase-2. Toward nontoxic chemotherapy targeting tumor microenvironment. J Med Chem55:7875-82 (2012) 
 
Carbonic anhydrase 2
Name:Carbonic anhydrase 2
Type:Enzyme
Mol. Mass.:29250.71
Organism:Homo sapiens (Human)
Description:P00918
Residue:260
BDBM50146798
NameBDBM50146798
Synonyms:(cyclooctylamino)carbonylphosphonic acid | CHEMBL97709
TypeSmall organic molecule
Emp. Form.C9H18NO4P
Mol. Mass.235.2173
SMILESOP(O)(=O)C(=O)NC1CCCCCCC1