Reaction Details
TargetCarbonic anhydrase 1
LigandBDBM50396795
Substrate/Competitorn/a
Meas. Tech.ChEMBL_861928 (CHEMBL2173732)
IC50 980±n/a nM
Citation Reich, RHoffman, AVeerendhar, AMaresca, AInnocenti, ASupuran, CTBreuer, E Carbamoylphosphonates control tumor cell proliferation and dissemination by simultaneously inhibiting carbonic anhydrase IX and matrix metalloproteinase-2. Toward nontoxic chemotherapy targeting tumor microenvironment. J Med Chem55:7875-82 (2012) 
 
Carbonic anhydrase 1
Name:Carbonic anhydrase 1
Type:Enzyme
Mol. Mass.:28873.37
Organism:Homo sapiens (Human)
Description:P00915
Residue:261
BDBM50396795
NameBDBM50396795
Synonyms:CHEMBL2170077
TypeSmall organic molecule
Emp. Form.C15H17N2O7PS
Mol. Mass.400.343
SMILESOP(O)(=O)C(=O)NCCNS(=O)(=O)c1ccc(Oc2ccccc2)cc1