Reaction Details
TargetCarbonic anhydrase 1
LigandBDBM50396801
Substrate/Competitorn/a
Meas. Tech.ChEMBL_861928 (CHEMBL2173732)
IC50 9740±n/a nM
Citation Reich, RHoffman, AVeerendhar, AMaresca, AInnocenti, ASupuran, CTBreuer, E Carbamoylphosphonates control tumor cell proliferation and dissemination by simultaneously inhibiting carbonic anhydrase IX and matrix metalloproteinase-2. Toward nontoxic chemotherapy targeting tumor microenvironment. J Med Chem55:7875-82 (2012) 
 
Carbonic anhydrase 1
Name:Carbonic anhydrase 1
Type:Enzyme
Mol. Mass.:28873.37
Organism:Homo sapiens (Human)
Description:P00915
Residue:261
BDBM50396801
NameBDBM50396801
Synonyms:CHEMBL2172748
TypeSmall organic molecule
Emp. Form.C6H14N2O8P2
Mol. Mass.304.1315
SMILESOP(O)(=O)C(=O)NCCCCNC(=O)P(O)(O)=O