Reaction Details
Target72 kDa type IV collagenase
LigandBDBM50396791
Substrate/Competitorn/a
Meas. Tech.ChEMBL_861929 (CHEMBL2173733)
IC50 4000±n/a nM
Citation Reich, RHoffman, AVeerendhar, AMaresca, AInnocenti, ASupuran, CTBreuer, E Carbamoylphosphonates control tumor cell proliferation and dissemination by simultaneously inhibiting carbonic anhydrase IX and matrix metalloproteinase-2. Toward nontoxic chemotherapy targeting tumor microenvironment. J Med Chem55:7875-82 (2012) 
 
72 kDa type IV collagenase
Name:72 kDa type IV collagenase
Type:Enzyme
Mol. Mass.:73870.36
Organism:Homo sapiens (Human)
Description: P08253
Residue:660
BDBM50396791
NameBDBM50396791
Synonyms:CHEMBL2172744
TypeSmall organic molecule
Emp. Form.C19H25N2O7PS
Mol. Mass.456.45
SMILESOP(O)(=O)C(=O)NCCCCCCNS(=O)(=O)c1ccc(Oc2ccccc2)cc1