Reaction Details
Target72 kDa type IV collagenase
LigandBDBM50396790
Substrate/Competitorn/a
Meas. Tech.ChEMBL_861930 (CHEMBL2173734)
IC50 20000±n/a nM
Citation Reich, RHoffman, AVeerendhar, AMaresca, AInnocenti, ASupuran, CTBreuer, E Carbamoylphosphonates control tumor cell proliferation and dissemination by simultaneously inhibiting carbonic anhydrase IX and matrix metalloproteinase-2. Toward nontoxic chemotherapy targeting tumor microenvironment. J Med Chem55:7875-82 (2012) 
 
72 kDa type IV collagenase
Name:72 kDa type IV collagenase
Type:Enzyme
Mol. Mass.:73870.36
Organism:Homo sapiens (Human)
Description: P08253
Residue:660
BDBM50396790
NameBDBM50396790
Synonyms:CHEMBL2172745
TypeSmall organic molecule
Emp. Form.C16H17N2O6P
Mol. Mass.364.2897
SMILESOP(O)(=O)C(=O)NCCNC(=O)c1ccc(Oc2ccccc2)cc1