Reaction Details
TargetPhosphatidylinositol 3-kinase catalytic subunit type 3
LigandBDBM50396805
Substrate/Competitorn/a
Meas. Tech.ChEMBL_861943 (CHEMBL2173747)
IC50>10000±n/a nM
Citation Norman, MHAndrews, KLBo, YYBooker, SKCaenepeel, SCee, VJD'Angelo, NDFreeman, DJHerberich, BJHong, FTJackson, CLJiang, JLanman, BALiu, LMcCarter, JDMullady, ELNishimura, NPettus, LHReed, ABMiguel, TSSmith, ALStec, MMTadesse, STasker, AAidasani, DZhu, XSubramanian, RTamayo, NAWang, LWhittington, DAWu, BWu, TWurz, RPYang, KZalameda, LZhang, NHughes, PE Selective class I phosphoinositide 3-kinase inhibitors: optimization of a series of pyridyltriazines leading to the identification of a clinical candidate, AMG 511. J Med Chem55:7796-816 (2012) 
 
Phosphatidylinositol 3-kinase catalytic subunit type 3
Name:Phosphatidylinositol 3-kinase catalytic subunit type 3
Type:Enzyme
Mol. Mass.:101551.30
Organism:Homo sapiens (Human)
Description:Recombinant human Vps34 protein was expressed as monomeric GST-fusion and purified.
Residue:887
BDBM50396805
NameBDBM50396805
Synonyms:CHEMBL2170084
TypeSmall organic molecule
Emp. Form.C22H25F4N9O3S
Mol. Mass.571.551
SMILESCOc1ncc(Nc2ncc(cc2-c2nc(C)nc(N)n2)[C@@H](N2CCN(CC2)S(C)(=O)=O)C(F)(F)F)cc1F