Reaction Details
TargetSerine/threonine-protein kinase mTOR
LigandBDBM50396822
Substrate/Competitorn/a
Meas. Tech.ChEMBL_861945 (CHEMBL2173749)
IC50>10000±n/a nM
Citation Norman, MHAndrews, KLBo, YYBooker, SKCaenepeel, SCee, VJD'Angelo, NDFreeman, DJHerberich, BJHong, FTJackson, CLJiang, JLanman, BALiu, LMcCarter, JDMullady, ELNishimura, NPettus, LHReed, ABMiguel, TSSmith, ALStec, MMTadesse, STasker, AAidasani, DZhu, XSubramanian, RTamayo, NAWang, LWhittington, DAWu, BWu, TWurz, RPYang, KZalameda, LZhang, NHughes, PE Selective class I phosphoinositide 3-kinase inhibitors: optimization of a series of pyridyltriazines leading to the identification of a clinical candidate, AMG 511. J Med Chem55:7796-816 (2012) 
 
Serine/threonine-protein kinase mTOR
Name:Serine/threonine-protein kinase mTOR
Type:Rapamycin target protein
Mol. Mass.:288917.12
Organism:Homo sapiens (Human)
Description:P42345
Residue:2549
BDBM50396822
NameBDBM50396822
Synonyms:CHEMBL2170086 | US8772480, 360
TypeSmall organic molecule
Emp. Form.C23H30FN9O3S
Mol. Mass.531.606
SMILESCOc1ncc(Nc2ncc(cc2-c2nc(C)nc(N)n2)[C@@H](C)N2CCN(C[C@H]2C)S(C)(=O)=O)cc1F