Reaction Details
TargetGrowth hormone secretagogue receptor type 1
LigandBDBM50396895
Substrate/Competitorn/a
Meas. Tech.ChEMBL_862728 (CHEMBL2174353)
Ki 34.9±n/a nM
Citation Els, SSchild, EPetersen, PSKilian, TMMokrosinski, JFrimurer, TMChollet, CSchwartz, TWHolst, BBeck-Sickinger, AG An aromatic region to induce a switch between agonism and inverse agonism at the ghrelin receptor. J Med Chem55:7437-49 (2012) 
 
Growth hormone secretagogue receptor type 1
Name:Growth hormone secretagogue receptor type 1
Type:Receptor
Mol. Mass.:41334.57
Organism:Homo sapiens (Human)
Description:Receptor binding studies use plasma membranes from LLC PK-1 cells transiently transfected with hGHSR1a.
Residue:366
BDBM50396895
NameBDBM50396895
Synonyms:CHEMBL2170694
TypeSmall organic molecule
Emp. Form.C53H68N8O6
Mol. Mass.913.157
SMILESCC(C)C[C@H](NC(=O)[C@H](CC(C)C)NC(=O)[C@@H](Cc1cccc2ccccc12)NC(=O)[C@H](Cc1ccccc1)NC(=O)[C@@H](Cc1cccc2ccccc12)NC(=O)[C@@H](N)CCCCN)C(N)=O