Reaction Details
TargetHistone-lysine N-methyltransferase, H3 lysine-79 specific
LigandBDBM50396994
Substrate/Competitorn/a
Meas. Tech.ChEMBL_863118 (CHEMBL2175616)
Ki 1100±n/a nM
Citation Anglin, JLDeng, LYao, YCai, GLiu, ZJiang, HCheng, GChen, PDong, SSong, Y Synthesis and structure-activity relationship investigation of adenosine-containing inhibitors of histone methyltransferase DOT1L. J Med Chem55:8066-74 (2012) 
 
Histone-lysine N-methyltransferase, H3 lysine-79 specific
Name:Histone-lysine N-methyltransferase, H3 lysine-79 specific
Type:Protein
Mol. Mass.:184911.91
Organism:Homo sapiens (Human)
Description:Q8TEK3
Residue:1537
BDBM50396994
NameBDBM50396994
Synonyms:CHEMBL2170991
TypeSmall organic molecule
Emp. Form.C21H27N7O4S
Mol. Mass.473.549
SMILESNc1ncnc2n(cnc12)[C@@H]1O[C@H](CSCCCCNC(=O)Nc2ccccc2)[C@@H](O)[C@H]1O