Reaction Details
TargetHistone-lysine N-methyltransferase, H3 lysine-79 specific
LigandBDBM50294573
Substrate/Competitorn/a
Meas. Tech.ChEMBL_863118 (CHEMBL2175616)
Ki 25000±n/a nM
Citation Anglin, JLDeng, LYao, YCai, GLiu, ZJiang, HCheng, GChen, PDong, SSong, Y Synthesis and structure-activity relationship investigation of adenosine-containing inhibitors of histone methyltransferase DOT1L. J Med Chem55:8066-74 (2012) 
 
Histone-lysine N-methyltransferase, H3 lysine-79 specific
Name:Histone-lysine N-methyltransferase, H3 lysine-79 specific
Type:Protein
Mol. Mass.:184911.91
Organism:Homo sapiens (Human)
Description:Q8TEK3
Residue:1537
BDBM50294573
NameBDBM50294573
Synonyms:(2R,3R,4S,5S)-2-(6-amino-9H-purin-9-yl)-5-((2-aminoethylthio)methyl)tetrahydrofuran-3,4-diol 5'-DEOXY-5'-[2-(AMINO)ETHYLTHIO]ADENOSINE | CHEMBL563938
TypeSmall organic molecule
Emp. Form.C12H18N6O3S
Mol. Mass.326.375
SMILESNCCSC[C@H]1O[C@H]([C@H](O)[C@@H]1O)n1cnc2c(N)ncnc12