Reaction Details
TargetHistone-lysine N-methyltransferase, H3 lysine-79 specific
LigandBDBM50397024
Substrate/Competitorn/a
Meas. Tech.ChEMBL_863118 (CHEMBL2175616)
Ki 6500±n/a nM
Citation Anglin, JLDeng, LYao, YCai, GLiu, ZJiang, HCheng, GChen, PDong, SSong, Y Synthesis and structure-activity relationship investigation of adenosine-containing inhibitors of histone methyltransferase DOT1L. J Med Chem55:8066-74 (2012) 
 
Histone-lysine N-methyltransferase, H3 lysine-79 specific
Name:Histone-lysine N-methyltransferase, H3 lysine-79 specific
Type:Protein
Mol. Mass.:184911.91
Organism:Homo sapiens (Human)
Description:Q8TEK3
Residue:1537
BDBM50397024
NameBDBM50397024
Synonyms:CHEMBL2171180
TypeSmall organic molecule
Emp. Form.C19H30N6O5S
Mol. Mass.454.544
SMILESCC(C)CCNc1ncnc2n(cnc12)[C@@H]1O[C@H](CSCC[C@H](N)C(O)=O)[C@@H](O)[C@H]1O