Reaction Details
TargetProtein arginine N-methyltransferase 1 [11-371]
LigandBDBM50397030
Substrate/Competitorn/a
Meas. Tech.ChEMBL_863133 (CHEMBL2175631)
IC50 12000±n/a nM
Citation Wang, JChen, LSinha, SHLiang, ZChai, HMuniyan, SChou, YWYang, CYan, LFeng, YLi, KKLin, MFJiang, HZheng, YGLuo, C Pharmacophore-based virtual screening and biological evaluation of small molecule inhibitors for protein arginine methylation. J Med Chem55:7978-87 (2012) 
 
Protein arginine N-methyltransferase 1 [11-371]
Name:Protein arginine N-methyltransferase 1 [11-371]
Type:Protein
Mol. Mass.:41506.52
Organism:Homo sapiens (Human)
Description:Q99873[11-371]
Residue:361
BDBM50397030
NameBDBM50397030
Synonyms:CHEMBL2171189
TypeSmall organic molecule
Emp. Form.C35H24N2O5
Mol. Mass.552.5755
SMILESOc1ccc(cc1NC(=O)c1cccc2ccccc12)C(=O)c1ccc(O)c(NC(=O)c2cccc3ccccc23)c1