Reaction Details
TargetMethylated-DNA--protein-cysteine methyltransferase
LigandBDBM50397044
Substrate/Competitorn/a
Meas. Tech.ChEMBL_863278 (CHEMBL2176221)
IC50 25±n/a nM
Citation Zhu, RSeow, HABaumann, RPIshiguro, KPenketh, PGShyam, KSartorelli, AC Design of a hypoxia-activated prodrug inhibitor of O6-alkylguanine-DNA alkyltransferase. Bioorg Med Chem Lett22:6242-7 (2012) 
 
Methylated-DNA--protein-cysteine methyltransferase
Name:Methylated-DNA--protein-cysteine methyltransferase
Type:PROTEIN
Mol. Mass.:21651.27
Organism:Homo sapiens (Human)
Description:ChEMBL_144711
Residue:207
BDBM50397044
NameBDBM50397044
Synonyms:CHEMBL2171205
TypeSmall organic molecule
Emp. Form.C15H18N6O
Mol. Mass.298.343
SMILESCN(C)Cc1cccc(COc2nc(N)nc3nc[nH]c23)c1