Reaction Details
TargetcAMP-specific 3',5'-cyclic phosphodiesterase 7B
LigandBDBM50397052
Substrate/Competitorn/a
Meas. Tech.ChEMBL_863496 (CHEMBL2174777)
IC50 19±n/a nM
Citation Banerjee, APatil, SPawar, MYGullapalli, SGupta, PKGandhi, MNBhateja, DKBajpai, MSangana, RRGudi, GSKhairatkar-Joshi, NGharat, LA Imidazopyridazinones as novel PDE7 inhibitors: SAR and in vivo studies in Parkinson's disease model. Bioorg Med Chem Lett22:6286-91 (2012) 
 
cAMP-specific 3',5'-cyclic phosphodiesterase 7B
Name:cAMP-specific 3',5'-cyclic phosphodiesterase 7B
Type:Enzyme
Mol. Mass.:51842.76
Organism:Homo sapiens (Human)
Description:Q9NP56
Residue:450
BDBM50397052
NameBDBM50397052
Synonyms:CHEMBL2171423
TypeSmall organic molecule
Emp. Form.C24H32N6O2
Mol. Mass.436.5499
SMILESCOc1cc(ccc1-c1nc2c(C)nn(C3CCCCC3)c(=O)c2[nH]1)N1CCCNCC1