Reaction Details
TargetPhosphodiesterase
LigandBDBM50397084
Substrate/Competitorn/a
Meas. Tech.ChEMBL_863634 (CHEMBL2175366)
IC50 790±n/a nM
Citation Orrling, KMJansen, CVu, XLBalmer, VBregy, PShanmugham, AEngland, PBailey, DCos, PMaes, LAdams, Evan den Bogaart, EChatelain, EIoset, JRvan de Stolpe, AZorg, SVeerman, JSeebeck, TSterk, GJde Esch, IJLeurs, R Catechol pyrazolinones as trypanocidals: fragment-based design, synthesis, and pharmacological evaluation of nanomolar inhibitors of trypanosomal phosphodiesterase B1. J Med Chem55:8745-56 (2012) 
 
Phosphodiesterase
Name:Phosphodiesterase
Type:Protein
Mol. Mass.:103683.20
Organism:Trypanosoma brucei
Description:n/a
Residue:930
BDBM50397084
NameBDBM50397084
Synonyms:CHEMBL2171458
TypeSmall organic molecule
Emp. Form.C27H34N2O4
Mol. Mass.450.5699
SMILESCOc1ccc(COc2cc(ccc2OC)C2=NN(C3CCCCCC3)C(=O)C2(C)C)cc1