Reaction Details
TargetDelta-type opioid receptor
LigandBDBM50397110
Substrate/Competitorn/a
Meas. Tech.ChEMBL_863802 (CHEMBL2175968)
Ki 1010±n/a nM
Citation Mollica, APinnen, FStefanucci, AMannina, LSobolev, APLucente, GDavis, PLai, JMa, SWPorreca, FHruby, VJ cis-4-amino-L-proline residue as a scaffold for the synthesis of cyclic and linear endomorphin-2 analogues: part 2. J Med Chem55:8477-82 (2012) 
 
Delta-type opioid receptor
Name:Delta-type opioid receptor
Type:G Protein-Coupled Receptor (GPCR)
Mol. Mass.:40382.98
Organism:Homo sapiens (Human)
Description:Competition binding assays were carried out using membrane preparations from transfected HN9.10 cells that constitutively expressed the delta opioid receptor.
Residue:372
BDBM50397110
NameBDBM50397110
Synonyms:CHEMBL2171846
TypeSmall organic molecule
Emp. Form.C32H35N5O5
Mol. Mass.569.6508
SMILESN[C@@H](Cc1ccc(O)cc1)C(=O)N1C[C@@H]2C[C@H]1C(=O)N[C@H](Cc1ccccc1)C(=O)N[C@H](Cc1ccccc1)C(=O)N2