Reaction Details
TargetDelta-type opioid receptor
LigandBDBM50397109
Substrate/Competitorn/a
Meas. Tech.ChEMBL_863683 (CHEMBL2175525)
IC50 950±n/a nM
Citation Mollica, APinnen, FStefanucci, AMannina, LSobolev, APLucente, GDavis, PLai, JMa, SWPorreca, FHruby, VJ cis-4-amino-L-proline residue as a scaffold for the synthesis of cyclic and linear endomorphin-2 analogues: part 2. J Med Chem55:8477-82 (2012) 
 
Delta-type opioid receptor
Name:Delta-type opioid receptor
Type:Enzyme Catalytic Domain
Mol. Mass.:40577.25
Organism:MOUSE
Description:P32300
Residue:372
BDBM50397109
NameBDBM50397109
Synonyms:CHEMBL2171847
TypeSmall organic molecule
Emp. Form.C32H35N5O5
Mol. Mass.569.6508
SMILESN[C@@H](Cc1ccc(O)cc1)C(=O)N1C[C@@H]2C[C@H]1C(=O)N[C@H](Cc1ccccc1)C(=O)N[C@@H](Cc1ccccc1)C(=O)N2