Reaction Details
TargetMu-type opioid receptor
LigandBDBM50397111
Substrate/Competitorn/a
Meas. Tech.ChEMBL_863684 (CHEMBL2175526)
IC50 2300±n/a nM
Citation Mollica, APinnen, FStefanucci, AMannina, LSobolev, APLucente, GDavis, PLai, JMa, SWPorreca, FHruby, VJ cis-4-amino-L-proline residue as a scaffold for the synthesis of cyclic and linear endomorphin-2 analogues: part 2. J Med Chem55:8477-82 (2012) 
 
Mu-type opioid receptor
Name:Mu-type opioid receptor
Type:Enzyme Catalytic Domain
Mol. Mass.:11165.58
Organism:GUINEA PIG
Description:P97266
Residue:98
BDBM50397111
NameBDBM50397111
Synonyms:CHEMBL2171853
TypeSmall organic molecule
Emp. Form.C32H38N6O5
Mol. Mass.586.6813
SMILESN[C@@H](Cc1ccc(O)cc1)C(=O)N1C[C@@H](N)C[C@H]1C(=O)N[C@@H](Cc1ccccc1)C(=O)N[C@H](Cc1ccccc1)C(N)=O