Reaction Details
TargetMu-type opioid receptor
LigandBDBM50397109
Substrate/Competitorn/a
Meas. Tech.ChEMBL_863803 (CHEMBL2176093)
Ki 38±n/a nM
Citation Mollica, APinnen, FStefanucci, AMannina, LSobolev, APLucente, GDavis, PLai, JMa, SWPorreca, FHruby, VJ cis-4-amino-L-proline residue as a scaffold for the synthesis of cyclic and linear endomorphin-2 analogues: part 2. J Med Chem55:8477-82 (2012) 
 
Mu-type opioid receptor
Name:Mu-type opioid receptor
Type:G Protein-Coupled Receptor (GPCR)
Mol. Mass.:44789.51
Organism:Homo sapiens (Human)
Description:P35372
Residue:400
BDBM50397109
NameBDBM50397109
Synonyms:CHEMBL2171847
TypeSmall organic molecule
Emp. Form.C32H35N5O5
Mol. Mass.569.6508
SMILESN[C@@H](Cc1ccc(O)cc1)C(=O)N1C[C@@H]2C[C@H]1C(=O)N[C@H](Cc1ccccc1)C(=O)N[C@@H](Cc1ccccc1)C(=O)N2