Reaction Details
TargetCathepsin K
LigandBDBM50397137
Substrate/Competitorn/a
Meas. Tech.ChEMBL_864175 (CHEMBL2175124)
IC50 5±n/a nM
Citation Crawford, JJKenny, PWBowyer, JCook, CRFinlayson, JEHeyes, CHighton, AJHudson, JAJestel, AKrapp, SMartin, SMacfaul, PAMcDermott, BPMcGuire, TMMorley, ADMorris, JJPage, KMRibeiro, LRSawney, HSteinbacher, SSmith, CDossetter, AG Pharmacokinetic benefits of 3,4-dimethoxy substitution of a phenyl ring and design of isosteres yielding orally available cathepsin K inhibitors. J Med Chem55:8827-37 (2012) 
 
Cathepsin K
Name:Cathepsin K
Type:Enzyme
Mol. Mass.:36975.68
Organism:Homo sapiens (Human)
Description:P43235
Residue:329
BDBM50397137
NameBDBM50397137
Synonyms:CHEMBL2172002
TypeSmall organic molecule
Emp. Form.C24H33N5O4
Mol. Mass.455.5499
SMILESCOc1ccc(nc1OC)N1CCN([C@H](C)C1)C(=O)[C@@H]1CCCC[C@H]1C(=O)NC1(CC1)C#N