Reaction Details
TargetP2Y purinoceptor 12
LigandBDBM50397168
Substrate/Competitorn/a
Meas. Tech.ChEMBL_864185 (CHEMBL2175134)
Ki 5.7±n/a nM
Citation Zech, GHessler, GEvers, AWeiss, TFlorian, PJust, MCzech, JCzechtizky, WGörlitzer, JRuf, SKohlmann, MNazaré, M Identification of high-affinity P2Y12 antagonists based on a phenylpyrazole glutamic acid piperazine backbone. J Med Chem55:8615-29 (2012) 
 
P2Y purinoceptor 12
Name:P2Y purinoceptor 12
Type:Enzyme
Mol. Mass.:39458.48
Organism:Homo sapiens (Human)
Description:Q9H244
Residue:342
BDBM50397168
NameBDBM50397168
Synonyms:CHEMBL2172146
TypeSmall organic molecule
Emp. Form.C38H45N7O9
Mol. Mass.743.8054
SMILESOC(=O)CC[C@H](NC(=O)c1cc(OCC(=O)N2CCC[C@H]2C(=O)NC2CCC2)n(n1)-c1ccccc1)C(=O)N1CCN(CC1)C(=O)OCc1ccccc1