Reaction Details
TargetP2Y purinoceptor 12
LigandBDBM50397189
Substrate/Competitorn/a
Meas. Tech.ChEMBL_864185 (CHEMBL2175134)
Ki 56±n/a nM
Citation Zech, GHessler, GEvers, AWeiss, TFlorian, PJust, MCzech, JCzechtizky, WGörlitzer, JRuf, SKohlmann, MNazaré, M Identification of high-affinity P2Y12 antagonists based on a phenylpyrazole glutamic acid piperazine backbone. J Med Chem55:8615-29 (2012) 
 
P2Y purinoceptor 12
Name:P2Y purinoceptor 12
Type:Enzyme
Mol. Mass.:39458.48
Organism:Homo sapiens (Human)
Description:Q9H244
Residue:342
BDBM50397189
NameBDBM50397189
Synonyms:CHEMBL2172268
TypeSmall organic molecule
Emp. Form.C32H43N7O9
Mol. Mass.669.7253
SMILESCCOC(=O)N1CCN(CC1)C(=O)[C@H](CCC(O)=O)NC(=O)c1cc(OCC(=O)N2CCC[C@H]2C(=O)NC(C)C)n(n1)-c1ccccc1