Reaction Details
TargetPolyunsaturated fatty acid 5-lipoxygenase
LigandBDBM50397224
Substrate/Competitorn/a
Meas. Tech.ChEMBL_864588 (CHEMBL2176568)
IC50 2300±n/a nM
Citation Elkady, MNieß, RSchaible, AMBauer, JLuderer, SAmbrosi, GWerz, OLaufer, SA Modified acidic nonsteroidal anti-inflammatory drugs as dual inhibitors of mPGES-1 and 5-LOX. J Med Chem55:8958-62 (2012) 
 
Polyunsaturated fatty acid 5-lipoxygenase
Name:Polyunsaturated fatty acid 5-lipoxygenase
Type:Enzyme
Mol. Mass.:77972.74
Organism:Homo sapiens (Human)
Description:Recombinant protein was purified from E. coli lysate. After ammonium sulfate precipitation and subsequent steps, the supernatant (S100) was used for 5-LO activity assay.
Residue:674
BDBM50397224
NameBDBM50397224
Synonyms:CHEMBL2172779
TypeSmall organic molecule
Emp. Form.C31H21Cl2N3O3S
Mol. Mass.586.488
SMILESClc1ccc(cc1)S(=O)(=O)NC(=O)Cc1cn(nc1-c1ccc(cc1)C#Cc1cccc(Cl)c1)-c1ccccc1