Reaction Details
TargetPolyunsaturated fatty acid 5-lipoxygenase
LigandBDBM50397229
Substrate/Competitorn/a
Meas. Tech.ChEMBL_864588 (CHEMBL2176568)
IC50 5000±n/a nM
Citation Elkady, MNieß, RSchaible, AMBauer, JLuderer, SAmbrosi, GWerz, OLaufer, SA Modified acidic nonsteroidal anti-inflammatory drugs as dual inhibitors of mPGES-1 and 5-LOX. J Med Chem55:8958-62 (2012) 
 
Polyunsaturated fatty acid 5-lipoxygenase
Name:Polyunsaturated fatty acid 5-lipoxygenase
Type:Enzyme
Mol. Mass.:77972.74
Organism:Homo sapiens (Human)
Description:Recombinant protein was purified from E. coli lysate. After ammonium sulfate precipitation and subsequent steps, the supernatant (S100) was used for 5-LO activity assay.
Residue:674
BDBM50397229
NameBDBM50397229
Synonyms:CHEMBL2172774
TypeSmall organic molecule
Emp. Form.C25H18N2O2
Mol. Mass.378.4226
SMILESOC(=O)Cc1cn(nc1-c1ccc(cc1)C#Cc1ccccc1)-c1ccccc1