Reaction Details
TargetPolyunsaturated fatty acid 5-lipoxygenase
LigandBDBM50397231
Substrate/Competitorn/a
Meas. Tech.ChEMBL_864588 (CHEMBL2176568)
IC50 2000±n/a nM
Citation Elkady, MNieß, RSchaible, AMBauer, JLuderer, SAmbrosi, GWerz, OLaufer, SA Modified acidic nonsteroidal anti-inflammatory drugs as dual inhibitors of mPGES-1 and 5-LOX. J Med Chem55:8958-62 (2012) 
 
Polyunsaturated fatty acid 5-lipoxygenase
Name:Polyunsaturated fatty acid 5-lipoxygenase
Type:Enzyme
Mol. Mass.:77972.74
Organism:Homo sapiens (Human)
Description:Recombinant protein was purified from E. coli lysate. After ammonium sulfate precipitation and subsequent steps, the supernatant (S100) was used for 5-LO activity assay.
Residue:674
BDBM50397231
NameBDBM50397231
Synonyms:CHEMBL2172771
TypeSmall organic molecule
Emp. Form.C32H24Cl2N2O3S
Mol. Mass.587.516
SMILESCc1c(CC(=O)NS(=O)(=O)c2ccc(Cl)cc2)c2cc(ccc2n1Cc1ccc(Cl)cc1)C#Cc1ccccc1