Reaction Details
TargetProstaglandin E synthase
LigandBDBM50397226
Substrate/Competitorn/a
Meas. Tech.ChEMBL_864584 (CHEMBL2176564)
IC50 200±n/a nM
Citation Elkady, MNieß, RSchaible, AMBauer, JLuderer, SAmbrosi, GWerz, OLaufer, SA Modified acidic nonsteroidal anti-inflammatory drugs as dual inhibitors of mPGES-1 and 5-LOX. J Med Chem55:8958-62 (2012) 
 
Prostaglandin E synthase
Name:Prostaglandin E synthase
Type:Protein
Mol. Mass.:17112.22
Organism:Homo sapiens (Human)
Description:n/a
Residue:152
BDBM50397226
NameBDBM50397226
Synonyms:CHEMBL2172777
TypeSmall organic molecule
Emp. Form.C31H22ClN3O3S
Mol. Mass.552.043
SMILESClc1ccc(cc1)S(=O)(=O)NC(=O)Cc1cn(nc1-c1ccc(cc1)C#Cc1ccccc1)-c1ccccc1