Reaction Details
TargetProstaglandin E synthase
LigandBDBM50397229
Substrate/Competitorn/a
Meas. Tech.ChEMBL_864584 (CHEMBL2176564)
IC50 400±n/a nM
Citation Elkady, MNieß, RSchaible, AMBauer, JLuderer, SAmbrosi, GWerz, OLaufer, SA Modified acidic nonsteroidal anti-inflammatory drugs as dual inhibitors of mPGES-1 and 5-LOX. J Med Chem55:8958-62 (2012) 
 
Prostaglandin E synthase
Name:Prostaglandin E synthase
Type:Protein
Mol. Mass.:17112.22
Organism:Homo sapiens (Human)
Description:n/a
Residue:152
BDBM50397229
NameBDBM50397229
Synonyms:CHEMBL2172774
TypeSmall organic molecule
Emp. Form.C25H18N2O2
Mol. Mass.378.4226
SMILESOC(=O)Cc1cn(nc1-c1ccc(cc1)C#Cc1ccccc1)-c1ccccc1