Reaction Details
TargetProstaglandin E synthase
LigandBDBM50397233
Substrate/Competitorn/a
Meas. Tech.ChEMBL_864584 (CHEMBL2176564)
IC50 1750±n/a nM
Citation Elkady, MNieß, RSchaible, AMBauer, JLuderer, SAmbrosi, GWerz, OLaufer, SA Modified acidic nonsteroidal anti-inflammatory drugs as dual inhibitors of mPGES-1 and 5-LOX. J Med Chem55:8958-62 (2012) 
 
Prostaglandin E synthase
Name:Prostaglandin E synthase
Type:Protein
Mol. Mass.:17112.22
Organism:Homo sapiens (Human)
Description:n/a
Residue:152
BDBM50397233
NameBDBM50397233
Synonyms:CHEMBL2172768
TypeSmall organic molecule
Emp. Form.C25H22BrClN2O3S
Mol. Mass.545.876
SMILESCc1c(CC(=O)NS(=O)(=O)c2ccc(C)cc2)c2cc(Br)ccc2n1Cc1ccc(Cl)cc1